{"text_format":"1","workbook":"xlsx","n_sheets":8,"sheets":["Conseils d'utilisation","Déclaration 2020 sur 2021","Déclaration 2021 sur 2022","Déclaration 2022 sur 2023","Déclaration 2023 sur 2024","Déclaration 2024 sur 2025","Déclaration 2025 sur 2026","Paramètres"],"not_rendered":{"charts":4,"images":17,"macros":1,"external_links":0,"defined_names":76,"comments":6,"pivot_tables":0},"unopened":[],"bounds":{"document_bytes":16777216,"sheet_cells":100000,"rows_first":2000,"rows_last":500,"rows_between":2000,"halvings":0,"cell_chars":16384,"cell_head_chars":4096},"cells_cut":0,"cells_raw":0,"read":"whole","date_system":"1900"}

{"sheet":"Conseils d'utilisation","index":0,"n_rows":87,"n_cols":14,"rows_kept":87,"cut":false,"hidden":false,"merged":[[7,14,7,15],[7,16,7,17],[7,8,7,9],[91,2,91,9],[7,6,7,7],[7,4,7,5],[7,2,7,3],[7,10,7,11],[7,12,7,13],[84,2,85,20],[86,2,86,5]]}
[]
[]
[]
[]
[]
[]
[]
[]
[]
[]
[]
[null,null,"Comment ça marche ?"]
[]
[null,null,"Vous avez des cases de différentes couleurs :"]
[]
[null,null,"Intitulé des questions",null,null,"Blanches "]
[]
[null,null,"Données à saisir ",null,null,"Orange"]
[]
[]
{"$rows_left_out":68}
{"sheet":"Déclaration 2020 sur 2021","index":1,"n_rows":113,"n_cols":14,"rows_kept":113,"cut":false,"hidden":false,"merged":[[9,0,9,4],[93,8,93,9],[104,12,106,12],[40,8,41,12],[89,8,89,12],[91,8,91,9],[92,8,92,9],[66,8,66,9],[68,8,68,9],[46,8,46,9],[59,8,59,9],[85,8,85,12],[98,8,99,12],[78,8,78,9],[81,8,81,9],[77,8,77,9],[80,8,80,9],[75,8,75,9],[74,8,74,9],[60,8,60,9],[62,8,62,9],[63,8,63,9],[65,8,65,9],[3,5,4,12],[14,8,14,12],[69,8,69,9],[71,8,71,9],[72,8,72,9],[20,8,20,9],[25,8,25,9],[33,8,34,12],[36,8,36,9],[43,8,43,9]]}
[]
[]
[]
[null,null,null,null,null,"Dans un souci de maintien et suivi des mises à jour du simulateur, il est recommandé de s’adresser exclusivement à l’Agefiph et pour toute question sur ce fichier merci de contacter reformeoeth@agefiph.asso.fr"]
[]
[]
[null,null,null,"<<",null,null,null,null,null,null,null,null,null,">>"]
[]
[null,null,null,null,null,null,null,null,null,null,"Année d'exercice :",null,2020]
["Accès onglets",null,null,null,null,null,null,null,"Effectif Moyen Annuel de l'entreprise",null,null,null,"Objectif d'emploi de travailleurs handicapés"]
[null,null,null,null,null,null,null,null,null,{"$f":"IF(I11<20,\"L'effectif saisi doit être supérieur ou égal à 20\",\"\")","v":"L'effectif saisi doit être supérieur ou égal à 20"},null,null,{"$f":"IF(I11<20,0,ROUNDDOWN(I11*Objemploi,0))","v":0}]
[]
[]
[]
[null,null,null,null,null,null,null,null,"I . Calcul de l'effectif moyen annuel de bénéficiaire(s) de l'obligation d'emploi "]
[]
[null,null,null,null,null,null,null,null,null,null,null,null,"Nombre BOETH total employés"]
[null,null,null,null,null,null,null,null,null,null,null,null,{"$f":"ROUND(I23+ROUND((J23*Survalo),2)+I28+ROUND((J28*Survalo),2),2)","v":0}]
[]
[]
{"$rows_left_out":94}
{"sheet":"Déclaration 2021 sur 2022","index":2,"n_rows":113,"n_cols":14,"rows_kept":113,"cut":false,"hidden":false,"merged":[[9,0,9,4],[62,8,62,9],[3,5,4,12],[14,8,14,12],[20,8,20,9],[25,8,25,9],[33,8,34,12],[36,8,36,9],[40,8,41,12],[43,8,43,9],[46,8,46,9],[59,8,59,9],[60,8,60,9],[80,8,80,9],[63,8,63,9],[65,8,65,9],[66,8,66,9],[68,8,68,9],[69,8,69,9],[71,8,71,9],[72,8,72,9],[74,8,74,9],[75,8,75,9],[77,8,77,9],[78,8,78,9],[98,8,99,12],[104,12,106,12],[81,8,81,9],[85,8,85,12],[89,8,89,12],[91,8,91,9],[92,8,92,9],[93,8,93,9]]}
[]
[]
[]
[null,null,null,null,null,"Dans un souci de maintien et suivi des mises à jour du simulateur, il est recommandé de s’adresser exclusivement à l’Agefiph et pour toute question sur ce fichier merci de contacter reformeoeth@agefiph.asso.fr"]
[]
[]
[null,null,null,"<<",null,null,null,null,null,null,null,null,null,">>"]
[]
[null,null,null,null,null,null,null,null,null,null,"Année d'exercice :",null,2021]
["Accès onglets",null,null,null,null,null,null,null,"Effectif Moyen Annuel de l'entreprise",null,null,null,"Objectif d'emploi de travailleurs handicapés"]
[null,null,null,null,null,null,null,null,null,{"$f":"IF(I11<20,\"L'effectif saisi doit être supérieur ou égal à 20\",\"\")","v":"L'effectif saisi doit être supérieur ou égal à 20"},null,null,{"$f":"IF(I11<20,0,ROUNDDOWN(I11*Objemploi_2,0))","v":0}]
[]
[]
[]
[null,null,null,null,null,null,null,null,"I . Calcul de l'effectif moyen annuel de bénéficiaire(s) de l'obligation d'emploi "]
[]
[null,null,null,null,null,null,null,null,null,null,null,null,"Nombre BOETH total employés"]
[null,null,null,null,null,null,null,null,null,null,null,null,{"$f":"ROUND(I23+ROUND((J23*Survalo),2)+I28+ROUND((J28*Survalo),2),2)","v":0}]
[]
[]
{"$rows_left_out":94}
{"sheet":"Déclaration 2022 sur 2023","index":3,"n_rows":113,"n_cols":30,"rows_kept":113,"cut":false,"hidden":false,"merged":[[78,8,78,9],[9,0,9,4],[62,8,62,9],[3,5,4,12],[14,8,14,12],[20,8,20,9],[25,8,25,9],[33,8,34,12],[36,8,36,9],[40,8,41,12],[43,8,43,9],[46,8,46,9],[59,8,59,9],[60,8,60,9],[104,12,106,12],[81,8,81,9],[85,8,85,12],[89,8,89,12],[91,8,91,9],[92,8,92,9],[93,8,93,9],[2,24,3,29],[4,24,8,29],[9,24,9,29],[10,24,10,27],[98,8,99,12],[80,8,80,9],[63,8,63,9],[65,8,65,9],[66,8,66,9],[68,8,68,9],[69,8,69,9],[71,8,71,9],[72,8,72,9],[74,8,74,9],[75,8,75,9],[77,8,77,9],[14,24,15,24],[14,25,15,25],[14,26,14,28],[16,24,17,24],[16,26,17,26],[16,27,17,27],[16,28,17,28],[30,29,31,29],[28,24,29,24],[28,25,29,25],[28,26,29,26],[28,27,29,27],[28,28,29,28],[30,24,31,24],[30,25,31,25],[30,26,31,26],[30,27,31,27],[30,28,31,28],[11,24,12,29],[40,24,41,29],[43,24,44,29],[32,29,33,29],[34,24,35,24],[34,25,35,25],[34,26,35,26],[34,27,35,27],[34,28,35,28],[34,29,35,29],[32,24,33,24],[32,25,33,25],[32,26,33,26],[32,27,33,27],[32,28,33,28],[28,29,29,29]]}
[]
[]
[null,null,null,null,null,null,null,null,null,null,null,null,null,null,null,null,null,null,null,null,null,null,null,null,"Vous devez déclarer en DSN pour la DOETH annuelle : "]
[null,null,null,null,null,"Dans un souci de maintien et suivi des mises à jour du simulateur, il est recommandé de s’adresser exclusivement à l’Agefiph et pour toute question sur ce fichier merci de contacter reformeoeth@agefiph.asso.fr"]
[null,null,null,null,null,null,null,null,null,null,null,null,null,null,null,null,null,null,null,null,null,null,null,null,"Rappel : Votre organisme social, URSSAF ou MSA, vous adresse le 15 mars au plus tard une notification des effectifs moyens annuels (EMA) servant  au calcul de l'obligation d'emploi (EMA d'assujetissement, EMA ECAP et EMA Boeth). Vous devez déclarer chaque mois en DSN vos salariés (pour l'EMA assujettissement en ETP) avec le code métier PCS (qui permettra de générer l'EMA ECAP) et préciser obligatoirement si le salarié est reconnu Boeth (EMA Boeth) "]
[]
[null,null,null,"<<",null,null,null,null,null,null,null,null,null,">>"]
[]
[null,null,null,null,null,null,null,null,null,null,"Année d'exercice :",null,2022]
["Accès onglets",null,null,null,null,null,null,null,"Effectif Moyen Annuel de l'entreprise",null,null,null,"Objectif d'emploi de travailleurs handicapés",null,null,null,null,null,null,null,null,null,null,null,"Déclaration annuelle en DSN : seules les informations ci-dessous sont demandées en DSN pour votre DOETH. Les autres informations à renseigner dans le simulateur servent à calculer le montant de la contribution en appliquant les différentes régles de calcul."]
[null,null,null,null,null,null,null,null,null,{"$f":"IF(I11<20,\"L'effectif saisi doit être supérieur ou égal à 20\",\"\")","v":"L'effectif saisi doit être supérieur ou égal à 20"},null,null,{"$f":"IF(I11<20,0,ROUNDDOWN(I11*Objemploi_3,0))","v":0},null,null,null,null,null,null,null,null,null,null,null,null,null,null,null,"Le Smic à utiliser pour la contribution 2022 est celui en vigueur au 31/12/2022 : ",11.07]
[null,null,null,null,null,null,null,null,null,null,null,null,null,null,null,null,null,null,null,null,null,null,null,null,"Pour mémoire : une entreprise qui est créée ou qui passe le seuil de 20 salariés à partir du 1er janvier 2020, bénéficie d’une période de neutralisation  de  5 ans avant d’être assujettie à l’obligation d’emploi des travailleurs handicapés et aucune contribution n’est due pendant la période."]
[]
[]
[null,null,null,null,null,null,null,null,"I . Calcul de l'effectif moyen annuel de bénéficiaire(s) de l'obligation d'emploi ",null,null,null,null,null,null,null,null,null,null,null,null,null,null,null,"Intitulé/thème","Vous avez indiqué dans le simulateur","Vous devez déclarer en DSN, en précisant le millésime de rattachement : année ",null,null,{"$f":"M9","v":2022}]
[null,null,null,null,null,null,null,null,null,null,null,null,null,null,null,null,null,null,null,null,null,null,null,null,null,null,"DSN- Code bloc/rubrique","DSN- intitulé bloc/rubrique","DSN- Code énuméré","Valeur à déclarer"]
[null,null,null,null,null,null,null,null,null,null,null,null,"Nombre BOETH total employés",null,null,null,null,null,null,null,null,null,null,null,"Effectif Boeth externe ETP  (+ et -50 ans,) : entreprises de travail temporaire, groupement employeurs, associations intermédiaires, agences de mannequins et entreprises de travail à temps partagé","En ETP","S21.G00.13.002","Type BOETH","\"01 - BOETH intérimaires\" ; \"02 - BOETH salariés d'un groupement d'employeurs mis à disposition» ; \"03 - BOETH stagiaires n’ayant pas fait l’objet d’une déclaration nominative au préalable \" ; 04 - BOETH salariés d’une association intermédiaire mis à disposition \" ; \"05 - BOETH salariés d’une agence de mannequin mis à disposition\" ; \"06 - BOETH salariés d’une entreprise de travail à temps partagé (ETTP) mis à disposition\""," \"Total en ETP valorisé sénior, à répartir dans les codes selon  votre cas\""]
[null,null,null,null,null,null,null,null,null,null,null,null,{"$f":"ROUND(I23+ROUND((J23*Survalo),2)+I28+ROUND((J28*Survalo),2),2)","v":0},null,null,null,null,null,null,null,null,null,null,null,null,{"$f":"I28+J28","v":0},null,null,null,{"$f":"I28+(J28*1.5)","v":0}]
[null,null,null,null,null,null,null,null,null,null,null,null,null,null,null,null,null,null,null,null,null,null,null,null,"Accord agréé de branche, de groupe ou d'entreprise",{"$f":"M38","v":"Non"},"S21.G00.13.001","Accord agréé OETH ","liste déroulante*","Sélectionner le code dans la liste déroulante"]
[null,null,null,null,null,null,null,null,null,null,null,null,null,null,null,null,null,null,null,null,null,null,null,null,"ECAP",{"$f":"I61","v":0},"S21.G00.82.002 ","Code cotisation ","valeur 060 – Déduction ECAP",{"$f":"M61","v":0}]
{"$rows_left_out":94}
{"sheet":"Déclaration 2023 sur 2024","index":4,"n_rows":116,"n_cols":14,"rows_kept":116,"cut":false,"hidden":false,"merged":[[9,0,9,4],[62,8,62,9],[3,5,4,12],[14,8,14,12],[20,8,20,9],[25,8,25,9],[33,8,34,12],[36,8,36,9],[40,8,41,12],[43,8,43,9],[46,8,46,9],[59,8,59,9],[60,8,60,9],[80,8,80,9],[63,8,63,9],[65,8,65,9],[66,8,66,9],[68,8,68,9],[69,8,69,9],[71,8,71,9],[72,8,72,9],[74,8,74,9],[75,8,75,9],[77,8,77,9],[78,8,78,9],[98,8,99,12],[104,12,106,12],[81,8,81,9],[85,8,85,12],[89,8,89,12],[91,8,91,9],[92,8,92,9],[93,8,93,9]]}
[]
[]
[]
[null,null,null,null,null,"Dans un souci de maintien et suivi des mises à jour du simulateur, il est recommandé de s’adresser exclusivement à l’Agefiph et pour toute question sur ce fichier merci de contacter reformeoeth@agefiph.asso.fr"]
[]
[]
[null,null,null,"<<",null,null,null,null,null,null,null,null,null,">>"]
[]
[null,null,null,null,null,null,null,null,null,null,"Année d'exercice :",null,2023]
["Accès onglets",null,null,null,null,null,null,null,"Effectif Moyen Annuel de l'entreprise",null,null,null,"Objectif d'emploi de travailleurs handicapés"]
[null,null,null,null,null,null,null,null,null,{"$f":"IF(I11<20,\"L'effectif saisi doit être supérieur ou égal à 20\",\"\")","v":"L'effectif saisi doit être supérieur ou égal à 20"},null,null,{"$f":"IF(I11<20,0,ROUNDDOWN(I11*Objemploi_4,0))","v":0}]
[]
[]
[]
[null,null,null,null,null,null,null,null,"I . Calcul de l'effectif moyen annuel de bénéficiaire(s) de l'obligation d'emploi "]
[]
[null,null,null,null,null,null,null,null,null,null,null,null,"Nombre BOETH total employés"]
[null,null,null,null,null,null,null,null,null,null,null,null,{"$f":"ROUND(I23+ROUND((J23*Survalo),2)+I28+ROUND((J28*Survalo),2),2)","v":0}]
[]
[]
{"$rows_left_out":97}
{"sheet":"Déclaration 2024 sur 2025","index":5,"n_rows":96,"n_cols":14,"rows_kept":96,"cut":false,"hidden":false,"merged":[[36,8,36,9],[9,0,9,4],[3,5,4,12],[14,8,14,12],[20,8,20,9],[25,8,25,9],[33,8,34,12],[71,8,71,9],[40,8,41,12],[43,8,43,9],[46,8,46,9],[59,8,59,9],[60,8,60,9],[62,8,62,9],[63,8,63,9],[65,8,65,9],[66,8,66,9],[68,8,68,9],[69,8,69,9],[93,8,93,9],[72,8,72,9],[74,8,74,9],[75,8,75,9],[77,8,77,9],[78,8,78,9],[80,8,80,9],[81,8,81,9],[85,8,85,12],[89,8,89,12],[91,8,91,9],[92,8,92,9]]}
[]
[]
[]
[null,null,null,null,null,"Dans un souci de maintien et suivi des mises à jour du simulateur, il est recommandé de s’adresser exclusivement à l’Agefiph et pour toute question sur ce fichier merci de contacter reformeoeth@agefiph.asso.fr"]
[]
[]
[null,null,null,"<<",null,null,null,null,null,null,null,null,null,">>"]
[]
[null,null,null,null,null,null,null,null,null,null,"Année d'exercice :",null,2024]
["Accès onglets",null,null,null,null,null,null,null,"Effectif Moyen Annuel de l'entreprise",null,null,null,"Objectif d'emploi de travailleurs handicapés"]
[null,null,null,null,null,null,null,null,null,{"$f":"IF(I11<20,\"L'effectif saisi doit être supérieur ou égal à 20\",\"\")","v":"L'effectif saisi doit être supérieur ou égal à 20"},null,null,{"$f":"IF(I11<20,0,ROUNDDOWN(I11*Objemploi_5,0))","v":0}]
[]
[]
[]
[null,null,null,null,null,null,null,null,"I . Calcul de l'effectif moyen annuel de bénéficiaire(s) de l'obligation d'emploi "]
[]
[null,null,null,null,null,null,null,null,null,null,null,null,"Nombre BOETH total employés"]
[null,null,null,null,null,null,null,null,null,null,null,null,{"$f":"ROUND(I23+ROUND((J23*Survalo),2)+I28+ROUND((J28*Survalo),2),2)","v":0}]
[]
[]
{"$rows_left_out":77}
{"sheet":"Déclaration 2025 sur 2026","index":6,"n_rows":84,"n_cols":18,"rows_kept":84,"cut":false,"hidden":false,"merged":[[36,8,36,9],[9,0,9,4],[3,5,4,12],[14,8,14,12],[20,8,20,9],[25,8,25,9],[33,8,34,12],[77,8,77,12],[81,8,81,12],[72,8,72,9],[71,8,71,9],[40,8,41,12],[43,8,43,9],[46,8,46,9],[59,8,59,9],[60,8,60,9],[62,8,62,9],[63,8,63,9],[65,8,65,9],[66,8,66,9],[68,8,68,9],[69,8,69,9]]}
[null,null,null,null,null,null,null,null,null,null,null,null,null,null,null,null,null,3000]
[null,null,null,null,null,null,null,null,null,null,null,null,null,null,null,null,null,3000]
[null,null,null,null,null,null,null,null,null,null,null,null,null,null,null,null,null,150]
[null,null,null,null,null,"Dans un souci de maintien et suivi des mises à jour du simulateur, il est recommandé de s’adresser exclusivement à l’Agefiph et pour toute question sur ce fichier merci de contacter reformeoeth@agefiph.asso.fr"]
[]
[]
[null,null,null,"<<",null,null,null,null,null,null,null,null,null,">>"]
[]
[null,null,null,null,null,null,null,null,null,null,"Année d'exercice :",null,2025]
["Accès onglets",null,null,null,null,null,null,null,"Effectif Moyen Annuel de l'entreprise",null,null,null,"Objectif d'emploi de travailleurs handicapés"]
[null,null,null,null,null,null,null,null,null,{"$f":"IF(I11<20,\"L'effectif saisi doit être supérieur ou égal à 20\",\"\")","v":"L'effectif saisi doit être supérieur ou égal à 20"},null,null,{"$f":"IF(I11<20,0,ROUNDDOWN(I11*Objemploi_6,0))","v":0}]
[]
[]
[]
[null,null,null,null,null,null,null,null,"I . Calcul de l'effectif moyen annuel de bénéficiaire(s) de l'obligation d'emploi "]
[]
[null,null,null,null,null,null,null,null,null,null,null,null,"Nombre BOETH total employés"]
[null,null,null,null,null,null,null,null,null,null,null,null,{"$f":"ROUND(I23+ROUND((J23*Survalo),2)+I28+ROUND((J28*Survalo),2),2)","v":0}]
[]
[]
{"$rows_left_out":65}
{"sheet":"Paramètres","index":7,"n_rows":89,"n_cols":6,"rows_kept":89,"cut":false,"hidden":false,"merged":[[10,1,10,12],[53,4,53,6],[30,2,30,6],[44,2,44,11],[33,2,33,11],[48,2,48,6],[52,2,52,6],[13,5,13,6],[12,2,12,3],[21,2,21,3],[34,5,35,5],[31,2,31,6],[14,5,14,6],[15,5,15,6],[39,2,39,11],[40,2,40,11],[41,2,41,11],[56,2,56,11],[57,5,58,5],[42,2,42,11],[43,2,43,11],[61,2,61,11],[64,5,65,5],[68,2,68,11],[70,2,70,11],[71,5,72,5],[63,2,63,11],[85,5,86,5],[89,2,89,11],[75,2,75,11],[77,2,77,11],[78,5,79,5],[82,2,82,11],[84,2,84,11]]}
[]
[]
[]
[]
[]
[]
[]
[]
[]
[]
[null,"Paramètres du simulateur"]
[]
[null,null,"SMIC ",null,null,"Formule liée à J8 (SHB)"]
[null,null,2020,10.15,null,{"$f":"VLOOKUP('Déclaration 2020 sur 2021'!$M$9,$C$14:$D$19,2,0)","v":10.15}]
[null,null,2021,10.48,null,{"$f":"VLOOKUP('Déclaration 2021 sur 2022'!$M$9,$C$14:$D$19,2,0)","v":10.48}]
[null,null,2022,11.07,null,{"$f":"VLOOKUP('Déclaration 2022 sur 2023'!$M$9,$C$14:$D$19,2,0)","v":11.07}]
[null,null,2023,11.52,null,{"$f":"VLOOKUP('Déclaration 2023 sur 2024'!$M$9,$C$14:$D$19,2,0)","v":11.52}]
[null,null,2024,11.52,null,{"$f":"VLOOKUP('Déclaration 2024 sur 2025'!$M$9,$C$14:$D$19,2,0)","v":11.52}]
[null,null,2025,11.52,null,{"$f":"VLOOKUP('Déclaration 2025 sur 2026'!$M$9,$C$14:$D$19,2,0)","v":11.52}]
[]
{"$rows_left_out":69}